Home > Specified Module > Error The Specified Module Could Not Be Found Pb

Error The Specified Module Could Not Be Found Pb

Contents

it's working in developer mode ,. All new questions should be directed to the appropriate forum at the SAP Community Network (SCN). files are damaged or missing ; 2. The program crashed. ‘The application was unable to start correctly (0xc000007b)' How can I fix this? http://strobelfilms.com/specified-module/error-specified-module-could-not-be-found.html

Please try to change them with 64 bit ones. Owner RSATom commented Dec 19, 2015 ha... if (env->me_fd != INVALID_HANDLE_VALUE) { #if defined(_MSC_VER) // Truncate the file size. Neil Shao says: March 23, 2015 at 1:37 am GPU version Caffe requires NVidia graphic card and CUDA. http://blog.yoocare.com/fix-the-specified-module-could-not-be-found-error-message-at-startup/

How To Fix Specified Module Could Not Be Found

Now in the below shown window, firstly switch to Everything tab. The set-up is pretty straight forward. to Error: The specified module could not be found. Reply kai li says: March 26, 2015 at 1:27 am how to fix "file.close()" error?

When you unzip the above downloaded file, under Autoruns folder you will see two applications namely; autoruns and autorunsc. Would this be possible? Go to Folder Options window, under View tab, tick Show hidden files and folders and non-tick Hide protected operating system files (Recommended) and then click OK. 3. The Specified Module Could Not Be Found Windows 10 It was necessary in my environment of Windows-7(Language is Japanese) to make the file path appropriate. 3.

As you can see in the above shown image, there is no error code whose reference you can take to fix this issue, even there is no help or support link Please review the > > stack trace for more information about the error and > > where it originated in the code. > > > > Exception Details: System.IO.FileNotFoundException: The > Corrupted file allocation; Note: If you want to fix this error, the first step is to identify the reason why you get this error first. more info here Outdated windows device drivers that require updating; 6.

Please take into account that Preview Build versions of Salamander and plugins could contain serious bugs. The Specified Module Could Not Be Found Windows 8 rulez added on the 2016-02-23 23:40:52 by ramon Haha too awesome! Your are my hero. After compile the caffe ,I have 631 link errors like this :1>solver.obj : error LNK2019: 无法解析的外部符号 "public: virtual __cdecl caffe::SolverParameter::~SolverParameter(void)" ([email protected]@@[email protected]),该符号在函数 "public: __cdecl caffe::Solver::Solver(class std::basic_string const &)" ([email protected]@[email protected]@[email protected][email protected][email protected]@[email protected]@[email protected]@[email protected]@[email protected]@@Z)

The Specified Module Could Not Be Found Usb

Although there are many programs can help clean up your registry or detect and remove viruses from your computer, they still cannot fix the error problem automatically. For quick setup and usage go to my GitHub. How To Fix Specified Module Could Not Be Found I didn't add the .cu files for this mode \caffe\src\caffe\syncedmem.cpp(93): error C4716: ‘caffe::SyncedMemory::gpu_data' : must return a value \caffe\src\caffe\syncedmem.cpp(109): error C4716: ‘caffe::SyncedMemory::mutable_gpu_data' : must return a value I could compile the The Specified Module Could Not Be Found Pendrive Can someone provide a pointer for C++?

Sorry for the inconvenience, it seems to be a basic Visual Studio problem and not a problem coming from the tutorial. check my blog This error reads: "The specified module could not be found." How can I fix this issue?" "There was a problem starting. Thanks! Copy libopenblas.dll  from OpenBLAS to caffe/bin. The Specified Module Could Not Be Found Windows 7

e.g. #define BOOST_LIB_VERSION "1_56" apollo says: March 2, 2015 at 9:04 am I had the same problem and solved by replacing boost 1.57 with 1.56 in my project. In the debug mode, I got the valid Test net output in first iteration. [email protected] Alok G says: March 22, 2015 at 4:46 am >> You have to have a GPU on your PC lol I do not have a GPU on my system. this content So that you can run caffe in VS.

Reply henrym says: April 6, 2015 at 2:45 am Hi, I followed your detailed steps and finally make it work. Rundll The Specified Module Could Not Be Found Usb Reply mingu says: September 1, 2015 at 11:35 am Is there any way to solve? There are some additional cpp files in tool folder to build, such as, extract_features.cpp, finetune_net.cpp, and so on.

Reply Neil Shao says: March 18, 2015 at 12:30 am Only .h and .lib files are needed for compilation.

Get rid of lmdb.lib from the project. 2. Jason says: June 18, 2015 at 5:16 am Hi, thanks for this tutorial, but i have met some problems. 1. 错误 18 error MSB3721: 命令“"C:\Program Files\NVIDIA GPU Computing Toolkit\C pouët.net logo I have no idea what i should do using windows… Juraj says: March 23, 2016 at 5:05 pm Hi Ilya, do you remember, how did you solve the problem with the The Specified Module Could Not Be Found Uninstall Thanks.

Two errors occured when I tried to compile the code in CPU_ONLY mode. File -> New -> Project Choose Win32 Console Application Set location to the root of Caffe Change Name to caffe (the generated exe file later is named after the project name, Reply Waheed Ahmed says: March 24, 2015 at 2:49 pm Hi, I have trained LeNet MNIST & CIFAR- 10 , But i am unable to train" VOC2012″ with caffe. have a peek at these guys Let’s do a QUICK TEST on MNIST!

IPhone/iPad Locked by the Illegal Pornography [email protected] Virus - How to Remove It? I was able to build and run caffe with VS2013 following your detailed instructions! Do you know why? Now we have every file compliable in Visual Studio.

Sorry but unfortunately, I didn't fix it. Change the following lines in "mdb.c". (1) Add the two lines at the top of the file. #pragma warning( disable : 4996 ) #pragma warning( disable : 4146 ) (2) Cast Thanks, Bonzi Reply Neil Shao says: April 12, 2015 at 4:34 am According to some comments below, maybe you are using 32 bit dll files of libgcc_s_seh-1.dll, libgcc_s_sjlj-1.dll, libgfortran-3.dll, libquadmath-0.dll. Note: Manual removal is a skillful and risky job, if any mistakes are made in the process, you may damage your computer immediately.

niuzhiheng's GitHub was of great help. Is this machine not capable of running caffe? Thanks! oink.

What's next to make this thing work? ;) added on the 2016-02-21 20:12:51 by ramon rulez added on the 2016-02-21 20:39:40 by moqui @ramon: Allright, this error means your win32com install if you will have some time, please take a look into minimal example(solution files + source): dropbox. I deleted "$" and add "; "in linker and found the following error: Error 109 error LNK1104: cannot open file ‘(CUDA_PATH_V6_5)\lib\,x64 ;C:\Users\dan\Documents\Utilities\opencv\build\x64\vc12\lib ;C:\local\boost_1_56_0\lib64-msvc-12.0$' C:\Users\dan\Documents\caffe-master\caffe\caffe\LINK caffe Neil Shao says: April 18, 2015