Home > Error Could > Error Could Not Find A Match For Std Multimap

Error Could Not Find A Match For Std Multimap

line 164: Error: Could not find a match for osg::osgTypedMethodFunctor2BaseCPtrRef(osg::Action::ResultE(*)(osg::Action*)) needed in static osg::ComponentTransform::initMethod(). Is every parallelogram a rectangle ?? You seem to have CSS turned off. We recommend upgrading to the latest Safari, Google Chrome, or Firefox. weblink

Does Wand of the War Mage apply to spells cast from other magic items? There are still errors occuring. My code so far is: #include #include #include #include #include using namespace std; enum { max_length = 1024 }; class client { public: boost::asio::streambuf receive_buffer; client(boost::asio::io_service& Defendant"? http://stackoverflow.com/questions/17087969/could-not-find-a-match-for-stdmultimap-error

For example the following compiles: #include #include int main() { std::multimap mapperizer; mapperizer.insert(std::pair(std::string("Foo"), 42)); } Also, the original version will compile successfully with stlport4 (command line Thanks in advance Regards c++ cc share|improve this question edited Jun 17 '13 at 18:23 Keine Lust 21.3k42448 asked Jun 17 '13 at 18:20 jamel 73312 so that mean current community chat Stack Overflow Meta Stack Overflow your communities Sign up or log in to customize your list. atof is also implemented in sun's library, so it can be fixed by just adding a || defined(__sun) in lines 804, 869, 994 of OSGBaseTypeTraits.h.

i installed 2.5.4 and the flex > errors vanish. > > there are still byte vector errors occuring: > "/home/ps790413/work/osg-cvs/OpenSG/Source/System/NodeCores/Drawables/Geometry/OSGGeoPropNormals.cpp", > line 86: Error: GeoNormals3bPropertyDesc is not defined. > line 89: and these: "/home/ps790413/work/osg-cvs/OpenSG/Source/System/NodeCores/Drawables/Nurbs/Internal/OSGNurbsPatchSurface.cpp", line 1421: Error: Could not find a match for std::multimap, std::allocator>>::insert(std::pair) needed in osg::CNurbsPatchSurface::CutCurve(const unsigned, osg::BezierCurve2D&, std::deque&, std::vector&, std::vector&). If there are still errors left let me know. I read on some internet that this can be avoided using the flag -library=stlport4 but actually I dont know which impact this will have on the application, can you advise me

regards, gerrit PS: I used SunStudio11 Re: [Opensg-users] OpenSG on Solaris 2.9 From: Patric Schmitz - 2005-12-20 08:03:51 Hello, Gerrit Voss wrote: > Hi, > > I commited the changes That would be great. If that doesn't help we need to > add some more #ifndef OSG_NO_INT8_PNT around some things. Last Post 18 Hours Ago Does anyone have any idea what language is this launcher application made in ?

Is this the problem with the solaris compiler? Thanks for the tip. Is it bad form to write mysterious proofs without explaining what one intends to do? If yes, then please also tell me how to do that, i guess i need a proper user account to do so..

What is this picture in Thrawn's study of? https://www.experts-exchange.com/questions/27643576/std-multimap-C-Solaris-SunStudio-12-complilation-error.html Sign in to comment Contact GitHub API Training Shop Blog About © 2016 GitHub, Inc. How to add tab in code - output to 2d barcode 10 replies I have a form in Acrobat DC with a data matrix barcode - when i scan the barcode They suggest compiling with -library=stlport4 if you don't want to modify/wrap multimap.

The female equivalent of "don't break my balls" Output the sign How should night time be determined and logged in a fast westbound plane? http://strobelfilms.com/error-could/error-could-not-find-xopendisplay-in.html Then i added a -DSUN to the SYSTEM_DEFINES in common.sparc-sun-solaris2.9-CC.mk. Not the answer you're looking for? From code readable perspective vector solution is perfect but I liked value_type the most.

using studio 10: there occured new intersectAction errors in OSGGeometry, OSGMoveManipulator, OSGRotateManipulator, OSGScaleManipulator and OSGSurface initMethod. return 0; } The above code is throwing a compilation error when i try to insert a vector as value with a string as a key.I am working on solaris. Please don't fill out this field. check over here more hot questions question feed lang-cpp about us tour help blog chat data legal privacy policy work here advertising info mobile contact us feedback Technology Life / Arts Culture / Recreation

asked 3 years ago viewed 490 times active 3 years ago Related 1std::multimap compile errors0What does it mean “internal compiler error: storage failure” on UNIX?0CPP Migration from Solaris to Linux1Linux CC If you are experiencing a similar issue, please ask a related question Suggested Solutions Title # Comments Views Activity maze travler 6 49 229d basic hardware to learn oop advanced design Help, my office wants infinite branch merges as policy; what other options do we have?

Subscribe to our monthly newsletter for tech news and trends Membership How it Works Gigs Live Careers Plans and Pricing For Business Become an Expert Resource Center About Us Who We

nrowe commented Mar 9, 2013 Oops, the template parameters were stripped out as html tags. Start a new discussion instead. Haven't tried it with other datatypes yet. I am getting an error saying Error: Could not find a match for std::multimap, std::allocator>>::insert(std::pair) needed in operator<<(std::ostream &, Output&) The same application was compiled with

I had a problem with the flex generated > files which i could solve by using another version, and now i get these > errors: > > "/home/ps790413/work/osg-cvs/OpenSG/Source/System/NodeCores/Drawables/Geometry/OSGGeoPropNormals.inl", > line 178: line 80: Error: PtrType is not defined. Is it bad form to write mysterious proofs without explaining what one intends to do? this content Tried many types of @media and css but can't seem to find the answer.

Dirk Re: [Opensg-users] OpenSG on Solaris 2.9 From: Gerrit Voss - 2005-12-15 06:27:59 Hi, On Fri, 2005-12-09 at 10:05 -0700, Dirk Reiners wrote: > Hi Patric, > > also, i Please show us some code... –TemplateRex Jun 13 '13 at 13:18 There appears to be much missing from this compiler in terms of C++ Standard conformity: oracle.com/technetwork/server-storage/solarisstudio/… –John Dibling Get out of the transit airport at Schengen area and the counting of Schengen period How can I turn rolled oats into flour without a food processor? It compiles cleanly without errors (also with a very minimal configuration) even using studio10.

line 164: Error: v is not defined. gmake[2]: *** [libzmq_la-socket_base.lo] Error 1 gmake[2]: Leaving directory `/export/home/rts/zmq-build/libzmq/src' gmake[1]: *** [all] Error 2 gmake[1]: Leaving directory `/export/home/rts/zmq-build/libzmq/src' gmake: *** [all-recursive] Error 1 It seems like the cause of this error share|improve this answer edited Jun 17 '13 at 20:20 answered Jun 17 '13 at 18:32 Mark B 77.3k465140 add a comment| Your Answer draft saved draft discarded Sign up or Now he compiles those files cleanly.

So try using : test.insert(std::multimap::value_type((int)1, (int)3)); Select all Open in new window instead of : test.insert(std::pair((int)1, (int)3)); Select all Open in new window 0 Message Author Comment by:sriram ID: Already have an account? Whether i will fail or succeed, i will post anything back to the list. share|improve this answer answered Jun 13 '13 at 15:42 Josh S. 1238 add a comment| Your Answer draft saved draft discarded Sign up or log in Sign up using Google

Is there maybe still an #ifdef missing? This is not the case with insert. –xtofl Jun 28 '13 at 10:12 This was the first thing i used and it did not work. –user1939168 Jun 28 '13 line 87218: Error: The function "yyensure_buffer_stack" must have a prototype. ... ... These are errors about not defined symbols, so i guess i have to modify the include/library path?